{"text_format":"1","workbook":"xlsx","n_sheets":3,"sheets":["Travel Reimbursement Master","Allowable Meal Calculations","RISD Mileage Chart"],"not_rendered":{"charts":0,"images":46,"macros":1,"external_links":0,"defined_names":39,"comments":1,"pivot_tables":0},"unopened":[],"bounds":{"document_bytes":16777216,"sheet_cells":100000,"rows_first":2000,"rows_last":500,"rows_between":2000,"halvings":0,"cell_chars":16384,"cell_head_chars":4096},"cells_cut":0,"cells_raw":0,"read":"whole","date_system":"1900"}

{"sheet":"Travel Reimbursement Master","index":0,"n_rows":77,"n_cols":19,"rows_kept":77,"cut":false,"hidden":false,"merged":[[65,9,65,10],[66,9,66,10],[67,9,67,10],[68,9,68,10],[76,9,76,10],[63,9,63,10],[33,9,33,10],[17,9,17,10],[34,9,34,10],[35,9,35,10],[36,9,36,10],[39,9,39,10],[57,9,57,10],[58,9,58,10],[59,9,59,10],[60,9,60,10],[61,9,61,10],[58,6,58,7],[59,6,59,7],[40,8,40,10],[28,5,28,6],[30,5,30,6],[31,5,31,6],[32,5,32,6],[33,5,33,6],[28,9,28,10],[29,9,29,10],[30,9,30,10],[31,9,31,10],[32,9,32,10],[41,5,41,6],[43,9,43,10],[38,8,38,10],[76,1,76,2],[39,3,39,4],[19,4,19,6],[2,0,2,12],[3,0,3,12],[4,0,4,12],[8,1,8,10],[15,1,15,10],[11,3,11,4],[13,3,13,4],[76,4,76,7],[22,8,22,10],[23,8,23,10],[57,6,57,7],[61,6,61,7],[60,6,60,7],[29,5,29,6],[11,7,11,10],[13,7,13,10],[19,7,19,8],[20,4,20,6],[20,7,20,8],[17,4,17,7]]}
[]
[null,null,null,null,"using tab key will move you from field to field easily"]
["DIRECTIONS:  Fill in ALL YELLOW fields only.  Print. Sign on Blue Shading.  "]
["Attach Proper documents, Obtain Proper signatures, submit to Business office."]
["Further instructions are in the green boxes"]
[]
[null,null,null,null,null,null,"Allowable Mileage Chart is on the 3rd tab"]
[null,null,null,null,null,null,"Your reimbursement will be calculated automatically"]
[null,"TRAVEL REIMBURSEMENT VOUCHER"]
[null,null,null,null,null,null,null,null,null,null,"v1.60"]
[]
[null,null,"Payee",null,null,"School or Location"]
[]
[null,null,"Title",null,null,null,"Mailing address"]
[]
[null,"For reimbursement of travel and other expenses incurred in the discharge of official duty as itemized and authorized by the Superintendent of Schools.  I do swear that the below account and itemization are just and true in all respects and that I have not received any additional reimbursement from any other source (Section 10-8-4, NMSA 1978)"]
[]
[null,null,null,"Signature of Payee:",null,null,null,null,"Date:","2022-08-18"]
[]
[]
[]
[]
[null,null,null,"Date of Departure:",null,null,"Time of departure"]
[null,null,null,"Date of Return:",null,null,"Time of return"]
[null,null,null,"Trip Totals",0,"Days",null,"00:00:00","Hrs"]
[]
[]
[]
[null,null,null,"I. PER DIEM (beyond normal 8-5 work day)","Out of District Travel Less than 24 hours","In State Travel    24 hrs or more",null,"Santa Fe           24 hrs or more","Out of State        24 hours or more","Per Diem Amount"]
[null,null,null,"Daily Rate (24 hrs)","N/A",155,null,202,155]
[0,null,null,"0 to 2 hours","N/A","N/A",null,"N/A","N/A"]
[1,null,null,"2 to 6 hours",20,"N/A",null,"N/A","N/A"]
[0,null,null,"6 to 12 hours",42,"N/A",null,"N/A","N/A"]
[null,null,null,"12 or more hours",59,"N/A",null,"N/A","N/A"]
[null,null,null,null,null,null,null,null,"Per Diem Total",{"$f":"SUM(J30:J34)","v":0}]
[null,null,null,null,null,null,null,null,null,0]
[null,null,null,null,null,null,null,null,"Net Per Diem",{"$f":"J35+MealReduc","v":0}]
[null,null,null,"II. TRANSPORTATION: (complete section only if applicable)"]
[null,null,null,null,null,null,null,"Rate",null,null,null,0,0,0]
[null,null,null,"Total Allowable miles from RISD Chart ",null,null,null,0.45,"Total Mileage",0,null,null,{"$f":"IF(D48=\"\",\"\",D48)","v":""},{"$f":"IF(E48=\"\",\"\",E48)","v":""},{"$f":"IF(F48=\"\",0,F48)","v":0},{"$f":"IF(G48=\"\",0,G48)","v":0},{"$f":"IF(G48=\"\",0,MIN(G48,ROUND(F48*0.2,2)))","v":0},0,"Enter a Valid Date for This Receipt"]
{"$rows_left_out":38}
{"sheet":"Allowable Meal Calculations","index":1,"n_rows":27,"n_cols":6,"rows_kept":27,"cut":false,"hidden":false,"merged":[]}
[null,"Maximum Actual Allowable Meals"]
[]
[null,"Actual Meals Allowance is Calculated for each 24 hour period beginning with Departure Date and Time."]
[null,"Maximum In State Rate for 24 hours is $59, Out of State is $59.  Tips cannot exceed 20%."]
[]
[]
[null,"Meal Receipts Calculation of Allowable Amount"]
[null,"Vendor","Date","Amount","Allowable"]
[null,{"$f":"'Travel Reimbursement Master'!M40","v":""},{"$f":"'Travel Reimbursement Master'!N40","v":""},{"$f":"IF(C9=\"\",\"\",'Travel Reimbursement Master'!O40+'Travel Reimbursement Master'!P40)","v":""},{"$f":"IF(AND(B9=\"\",C9=\"\"),\"\",'Travel Reimbursement Master'!R40)","v":""},{"$f":"IF(C9=\"\",\"\",'Travel Reimbursement Master'!S40)","v":""}]
[null,{"$f":"'Travel Reimbursement Master'!M41","v":""},{"$f":"'Travel Reimbursement Master'!N41","v":""},{"$f":"IF(C10=\"\",\"\",'Travel Reimbursement Master'!O41+'Travel Reimbursement Master'!P41)","v":""},{"$f":"IF(AND(B10=\"\",C10=\"\"),\"\",'Travel Reimbursement Master'!R41)","v":""},{"$f":"IF(C10=\"\",\"\",'Travel Reimbursement Master'!S41)","v":""}]
[null,{"$f":"'Travel Reimbursement Master'!M42","v":""},{"$f":"'Travel Reimbursement Master'!N42","v":""},{"$f":"IF(C11=\"\",\"\",'Travel Reimbursement Master'!O42+'Travel Reimbursement Master'!P42)","v":""},{"$f":"IF(AND(B11=\"\",C11=\"\"),\"\",'Travel Reimbursement Master'!R42)","v":""},{"$f":"IF(C11=\"\",\"\",'Travel Reimbursement Master'!S42)","v":""}]
[null,{"$f":"'Travel Reimbursement Master'!M43","v":""},{"$f":"'Travel Reimbursement Master'!N43","v":""},{"$f":"IF(C12=\"\",\"\",'Travel Reimbursement Master'!O43+'Travel Reimbursement Master'!P43)","v":""},{"$f":"IF(AND(B12=\"\",C12=\"\"),\"\",'Travel Reimbursement Master'!R43)","v":""},{"$f":"IF(C12=\"\",\"\",'Travel Reimbursement Master'!S43)","v":""}]
[null,{"$f":"'Travel Reimbursement Master'!M44","v":""},{"$f":"'Travel Reimbursement Master'!N44","v":""},{"$f":"IF(C13=\"\",\"\",'Travel Reimbursement Master'!O44+'Travel Reimbursement Master'!P44)","v":""},{"$f":"IF(AND(B13=\"\",C13=\"\"),\"\",'Travel Reimbursement Master'!R44)","v":""},{"$f":"IF(C13=\"\",\"\",'Travel Reimbursement Master'!S44)","v":""}]
[null,{"$f":"'Travel Reimbursement Master'!M45","v":""},{"$f":"'Travel Reimbursement Master'!N45","v":""},{"$f":"IF(C14=\"\",\"\",'Travel Reimbursement Master'!O45+'Travel Reimbursement Master'!P45)","v":""},{"$f":"IF(AND(B14=\"\",C14=\"\"),\"\",'Travel Reimbursement Master'!R45)","v":""},{"$f":"IF(C14=\"\",\"\",'Travel Reimbursement Master'!S45)","v":""}]
[null,{"$f":"'Travel Reimbursement Master'!M46","v":""},{"$f":"'Travel Reimbursement Master'!N46","v":""},{"$f":"IF(C15=\"\",\"\",'Travel Reimbursement Master'!O46+'Travel Reimbursement Master'!P46)","v":""},{"$f":"IF(AND(B15=\"\",C15=\"\"),\"\",'Travel Reimbursement Master'!R46)","v":""},{"$f":"IF(C15=\"\",\"\",'Travel Reimbursement Master'!S46)","v":""}]
[null,{"$f":"'Travel Reimbursement Master'!M47","v":""},{"$f":"'Travel Reimbursement Master'!N47","v":""},{"$f":"IF(C16=\"\",\"\",'Travel Reimbursement Master'!O47+'Travel Reimbursement Master'!P47)","v":""},{"$f":"IF(AND(B16=\"\",C16=\"\"),\"\",'Travel Reimbursement Master'!R47)","v":""},{"$f":"IF(C16=\"\",\"\",'Travel Reimbursement Master'!S47)","v":""}]
[null,{"$f":"'Travel Reimbursement Master'!M48","v":""},{"$f":"'Travel Reimbursement Master'!N48","v":""},{"$f":"IF(C17=\"\",\"\",'Travel Reimbursement Master'!O48+'Travel Reimbursement Master'!P48)","v":""},{"$f":"IF(AND(B17=\"\",C17=\"\"),\"\",'Travel Reimbursement Master'!R48)","v":""},{"$f":"IF(C17=\"\",\"\",'Travel Reimbursement Master'!S48)","v":""}]
[null,{"$f":"'Travel Reimbursement Master'!M49","v":""},{"$f":"'Travel Reimbursement Master'!N49","v":""},{"$f":"IF(C18=\"\",\"\",'Travel Reimbursement Master'!O49+'Travel Reimbursement Master'!P49)","v":""},{"$f":"IF(AND(B18=\"\",C18=\"\"),\"\",'Travel Reimbursement Master'!R49)","v":""},{"$f":"IF(C18=\"\",\"\",'Travel Reimbursement Master'!S49)","v":""}]
[null,{"$f":"'Travel Reimbursement Master'!M50","v":""},{"$f":"'Travel Reimbursement Master'!N50","v":""},{"$f":"IF(C19=\"\",\"\",'Travel Reimbursement Master'!O50+'Travel Reimbursement Master'!P50)","v":""},{"$f":"IF(AND(B19=\"\",C19=\"\"),\"\",'Travel Reimbursement Master'!R50)","v":""},{"$f":"IF(C19=\"\",\"\",'Travel Reimbursement Master'!S50)","v":""}]
[null,{"$f":"'Travel Reimbursement Master'!M51","v":""},{"$f":"'Travel Reimbursement Master'!N51","v":""},{"$f":"IF(C20=\"\",\"\",'Travel Reimbursement Master'!O51+'Travel Reimbursement Master'!P51)","v":""},{"$f":"IF(AND(B20=\"\",C20=\"\"),\"\",'Travel Reimbursement Master'!R51)","v":""},{"$f":"IF(C20=\"\",\"\",'Travel Reimbursement Master'!S51)","v":""}]
[null,{"$f":"'Travel Reimbursement Master'!M52","v":""},{"$f":"'Travel Reimbursement Master'!N52","v":""},{"$f":"IF(C21=\"\",\"\",'Travel Reimbursement Master'!O52+'Travel Reimbursement Master'!P52)","v":""},{"$f":"IF(AND(B21=\"\",C21=\"\"),\"\",'Travel Reimbursement Master'!R52)","v":""},{"$f":"IF(C21=\"\",\"\",'Travel Reimbursement Master'!S52)","v":""}]
[null,{"$f":"'Travel Reimbursement Master'!M53","v":""},{"$f":"'Travel Reimbursement Master'!N53","v":""},{"$f":"IF(C22=\"\",\"\",'Travel Reimbursement Master'!O53+'Travel Reimbursement Master'!P53)","v":""},{"$f":"IF(AND(B22=\"\",C22=\"\"),\"\",'Travel Reimbursement Master'!R53)","v":""},{"$f":"IF(C22=\"\",\"\",'Travel Reimbursement Master'!S53)","v":""}]
[null,{"$f":"'Travel Reimbursement Master'!M54","v":""},{"$f":"'Travel Reimbursement Master'!N54","v":""},{"$f":"IF(C23=\"\",\"\",'Travel Reimbursement Master'!O54+'Travel Reimbursement Master'!P54)","v":""},{"$f":"IF(AND(B23=\"\",C23=\"\"),\"\",'Travel Reimbursement Master'!R54)","v":""},{"$f":"IF(C23=\"\",\"\",'Travel Reimbursement Master'!S54)","v":""}]
[null,{"$f":"'Travel Reimbursement Master'!M55","v":""},{"$f":"'Travel Reimbursement Master'!N55","v":""},{"$f":"IF(C24=\"\",\"\",'Travel Reimbursement Master'!O55+'Travel Reimbursement Master'!P55)","v":""},{"$f":"IF(AND(B24=\"\",C24=\"\"),\"\",'Travel Reimbursement Master'!R55)","v":""},{"$f":"IF(C24=\"\",\"\",'Travel Reimbursement Master'!S55)","v":""}]
[null,{"$f":"'Travel Reimbursement Master'!M56","v":""},{"$f":"'Travel Reimbursement Master'!N56","v":""},{"$f":"IF(C25=\"\",\"\",'Travel Reimbursement Master'!O56+'Travel Reimbursement Master'!P56)","v":""},{"$f":"IF(AND(B25=\"\",C25=\"\"),\"\",'Travel Reimbursement Master'!R56)","v":""},{"$f":"IF(C25=\"\",\"\",'Travel Reimbursement Master'!S56)","v":""}]
[null,{"$f":"'Travel Reimbursement Master'!M57","v":""},{"$f":"'Travel Reimbursement Master'!N57","v":""},{"$f":"IF(C26=\"\",\"\",'Travel Reimbursement Master'!O57+'Travel Reimbursement Master'!P57)","v":""},{"$f":"IF(AND(B26=\"\",C26=\"\"),\"\",'Travel Reimbursement Master'!R57)","v":""},{"$f":"IF(C26=\"\",\"\",'Travel Reimbursement Master'!S57)","v":""}]
[null,"Totals",null,{"$f":"SUM(D9:D26)","v":0},{"$f":"SUM(E9:E26)","v":0}]

{"sheet":"RISD Mileage Chart","index":2,"n_rows":118,"n_cols":90,"rows_kept":118,"cut":false,"hidden":false,"merged":[[0,0,0,32],[3,0,3,32]]}
["Table of Distances"]
[]
[]
["Distances are computed following the shortest and most feasible route.  All distances are compiled from the Google Maps API."]
[]
["   ","Roswell, NM","Alamogordo, NM","Albuquerque, NM","Alpine, TX","Amarillo, TX","Anthony, NM","Artesia, NM","Arlington, TX","Aurora, CO","Austin, TX","Aztec, NM","Belen, NM 87002","Bernalillo, NM","Canyon, TX","Carlsbad, NM","Carrizozo, NM","Chama, NM","Chaparral, NM","Cimarron, NM","Clayton, NM","Cloudcroft, NM","Clovis, NM","Cuba, NM","Dallas, TX 75201","Deming, NM","Denver, CO","Dexter, NM 88230","El Paso, TX","Espanola, NM","Estancia, NM","Eunice, NM","Farmington, NM","Ft. Sumner, NM","Gallup, NM","Glorietta, NM","Grapevine, TX","Grants, NM","Gunnison, CO","Greeley, CO","Hagerman, NM","Hatch, NM","Hereford, TX","Hobbs, NM","Hondo, NM","Hurley, NM","Jal, NM","Laredo, TX 78040","Las Cruces, NM","Las Vegas, NM","Las Vegas, NV","Lordsburg, NM","Los Alamos, NM","Los Lunas, NM","Loving, NM 88256","Lovington, NM 88260","Lubbock, TX","Mescalero, NM","Midland, TX","Mora, NM","Mountainair, NM 87036","Moriarty, NM","Odessa, TX","Orlando, FL","Park City, UT","Phoenix, AZ","Pueblo, CO","Portales, NM","Raton, NM","Red River, NM","Reserve, NM","Rio Rancho, NM","Roy, NM","Ruidoso, NM","San Antonio, TX","San Patricio, NM","Santa Fe, NM","Santa Rosa, NM","Santa Teresa, NM","Silver City, NM","Socorro, NM","Springer, NM","Taos, NM","Tierra Amarillo, NM","Truth or Consequences, NM","Tucson, AZ","Tucumcari, NM","Tularosa, NM","Vaughn, NM","Zuni, NM"]
["Roswell, NM",null,117,198,272,214,205,41,474,502.2,507,375,198,214,197,76,90,299,190,270,273,116,111,279,492,243,505,17,205,218,154,132,379,84,336,190,483,276,469,566,24,218,166,116,47.9,281,148,579,184,179,773.6,304,226,223,89,95,174,87,207,210,155,163,201,1583,795,571,390,92,286,273,293,213,254,75,514,50.6,192,134,212,295,165,245,257,285,217,457,161,104,96,349]
["Alamogordo, NM",117,null,211,299,350,92,110,null,null,null,386,176,225,313,147,58,325,73,315,349,20,226,291,583,126,549,126,89,244,153,203,390,196,325,216,574,265,495,610,123,101,281,188,null,164,219,686,68,223,null,187,252,189,159,175,291,31,285,254,140,169,277,null,null,454,435,207,330,317,262,225,299,51,630,null,218,178,96,179,133,290,289,311,137,340,238,13,138,319]
["Albuquerque, NM",198,211,null,487,286,249,245,null,null,null,179,35,18,295,280,153,169,257,215,273,223,219,83,646,235,450,216,268,88,55,336,183,159,140,76,625,80,339,510,223,187,273,314,null,271,352,783,225,124,null,296,97,26,293,293,319,214,405,154,64,38,400,null,null,422,335,228,231,169,207,18,199,183,712,null,65,115,262,238,78,190,133,155,150,449,174,198,102,154]
["Alpine, TX",272,299,487,null,404,241,224,null,null,null,663,453,502,385,188,360,568,238,539,504,322,318,567,495,322,774,249,220,487,423,169,667,353,601,459,485,542,738,835,244,303,363,188,null,360,146,383,266,448,null,382,495,466,176,212,282,333,165,478,424,432,143,null,null,650,659,299,555,542,471,501,466,339,378,null,461,403,233,374,410,514,526,554,339,536,394,315,365,596]
["Amarillo, TX",214,350,286,404,null,437,260,null,null,null,462,320,301,19,284,292,387,422,240,132,325,106,367,364,475,434,230,438,306,267,243,467,166,424,272,340,364,445,450,237,473,48,220,null,556,277,616,417,238,null,536,314,311,289,209,124,300,239,269,276,251,259,null,null,705,320,123,215,281,492,301,174,287,499,null,280,172,444,523,363,214,295,372,436,689,115,336,211,437]
["Anthony, NM",205,92,249,241,437,null,202,null,null,null,424,214,263,404,183,149,414,14,406,440,111,317,328,657,83,641,217,22,333,259,250,428,287,362,321,646.9,302,584,701,214,64,373,252,null,121,245,628,27,315,null,143,341,227,187,256,361,122,326,345,236,286,304,null,null,411,526,298,422,414,232,262,390,142,573,null,309,270,14,135,171,381,378,400,100,297,329,105,230,356]
["Arlington, TX",474,null,null,null,null,null,null,null,null,null,null,null,null,null,null,null,null,null,null,null,null,null,null,null,null,null,null,null,null,null,null,null,null,null,null,464]
["Artesia, NM",41,110,245,224,260,202,null,null,null,null,420,244,259,243,36,130,344,183,316,318,90,156,325,473,236,550,26,204,264,200,92,425,130,382,236,17,322,515,611,20,212,211,77,null,274,108,539,178,224,null,297,272,269,49,65,172,101,175,255,201,209,167,null,null,565,436,137,331,318,333,259,300,115,487,null,238,179,218,289,205,291,302,330,257,450,206,116,142,395]
["Aurora, CO",502]
["Austin, TX",507,null,null,null,null,null,null,null,null,null,null,null,null,null,null,null,null,null,null,null,null,null,null,null,null,null,null,null,null,null,null,null,null,null,null,210]
["Aztec, NM",375,386,179,663,462,424,420,null,null,null,null,211,161,471,456,329,106,433,261,413,399,395,96,822,411,362,392,443,170,230,512,18,335,126,217,798,152,207,421,399,363,449,490,null,446,528,959,400,265,null,471,188,201,468,469,495,390,581,232,240,214,576,null,null,406,296,404,305,226,290,167,340,358,888,null,206,291,438,388,253,331,209,118,326,457,350,373,278,162]
["Belen, NM 87002",198,176,35,453,320,214,244,null,null,null,211,null,50,330,279,119,201,223,247,304,189,226,115,681,201,481,215,233,120,66,335,215,166,149,108,656,89,371,542,222,153,307,314,null,236,351,840,190,155,null,261,128,10,292,293,326,180,405,186,43,73,399,null,null,430,366,235,262,201,173,49,231,148,784,null,96,150,228,203,43,222,164,187,116,415,208,163,108,163]
["Bernalillo, NM",214,225,18,502,301,263,259,null,null,null,161,50,null,310,295,168,152,272,198,256,238,234,65,661,250,433,231,282,72,70,351,165,174,153,59,637,93,322,494,238,202,288,329,null,285,367,798,239,107,null,311,80,40,308,308,334,229,420,138,79,54,415,null,null,434,318,243,214,152,222,14,183,197,727,null,48,130,277,252,93,173,116,138,165,464,189,212,117,166]
["Canyon, TX",197,313,295,385,19,404,243,null,null,null,471,330,310,null,266,301,395,385,250,142,308,88,375,379,445,445,213,400,315,275,221,475,148,432,281,350,373,455,505,220,413,31,202,null,483,258,606,379,246,null,505,323,320,271,192,105,282,220,278,285,259,240,null,null,714,330,105,225,291,501,310,183,270,489,null,288,180,407,497,372,225,325,381,444,659,124,299,220,446]
["Carlsbad, NM",76,147,280,188,284,183,36,null,null,null,456,279,295,266,null,166,380,177,352,348,127,181,360,458,263,586,62,169,299,235,68,460,166,417,272,449,357,550,647,56,244,235,70,null,301,70,503,207,260,null,324,307,304,13,74,179,137,150,291,236,244,135,null,null,591,472,161,367,354,369,295,336,151,451,null,273,215,183,315,241,327,338,366,280,477,242,153,178,431]
["Carrizozo, NM",90,58,153,360,292,149,130,null,null,null,329,119,168,301,166,null,267,130,257,291,70,199,233,582,183,492,107,146,186,96,222,333,138,267,159,573,207,437,553,114,165,256,207,null,221,238,669,125,166,null,244,194,131,178,185,264,61,297,197,83,112,291,null,null,454,377,180,273,260,204,167,242,31,617,null,160,121,153,215,76,232,231,253,128,397,180,45,81,261]
["Chama, NM",299,325,169,568,387,414,344,null,null,null,106,201,152,395,380,267,null,424,150,257,337,319,74,746,401,312,316,434,81,175,436,112,259,224,126,722,195,213,373,322,354,373,414,null,437,452,883,391,173,null,462,99,192,392,393,419,328,505,143,198,159,500,null,null,504,197,328,206,123,373,162,249,296,812,null,106,215,428,404,244,175,95,15,317,615,274,311,202,261]
["Chaparral, NM",190,73,257,238,422,14,183,null,null,null,433,223,272,385,177,130,424,null,387,421,92,298,337,654,92,622,198,25,342,226,241,437,268,371,288,644,311,593,682,195,73,354,243,null,130,237,625,36,296,null,152,350,236,178,247,352,103,323,326,213,242,302,null,null,420,507,279,403,423,241,271,371,123,570,null,318,251,27,144,180,362,387,409,109,306,310,86,211,365]
["Cimarron, NM",270,315,215,539,240,406,316,null,null,null,261,247,198,250,352,257,150,387,null,108,327,220,173,600,447,261,288,403,99,206,408,265,202,350,139,576,290,271,321,294,399,239,346,null,482,423,824,382,93,null,507,116,237,364,326,320,318,428,70,229,190,423,null,null,631,146,238,42,41,419,207,71,287,707,null,159,158,410,449,289,26,55,135,362,661,163,302,177,363]
["Clayton, NM",273,349,273,504,132,440,318,null,null,null,413,304,256,142,348,291,257,421,108,null,362,168,318,492,504,302,289,438,242,263,335,418,195,407,197,468,347,313,363,296,456,142,313,null,539,358,737,417,151,null,565,250,294,353,274,245,353,360,157,286,247,365,null,null,688,188,186,83,149,476,265,88,321,620,null,216,172,445,506,347,82,163,243,419,718,112,337,211,420]
["Cloudcroft, NM",116,20,223,322,325,111,90,null,null,null,399,189,238,308,127,70,337,92,327,362,null,221,303,563,146,562,106,108,256,166,182,403,195,337,229,554,277,507,623,102,121,277,168,null,184,198,630,87,236,null,207,265,202,139,155,262,21,265,267,153,182,257,null,null,474,447,202,343,330,274,237,312,46,577,null,230,191,115,198,146,302,301,323,157,360,250,26,151,331]
["Clovis, NM",111,226,219,318,106,317,156,null,null,null,395,226,234,88,181,199,319,298,220,168,221,null,300,449,352,454,127,314,239,182,152,400,60,357,205,407,297,465,515,133,327,58,128,null,390,173,605,293,171,null,412,247,244,186,107,101,196,209,202,183,184,204,null,null,638,340,19,235,261,378,234,149,184,488,null,213,105,321,404,248,194,249,306,321,566,83,213,118,370]
["Cuba, NM",279,291,83,567,367,328,325,null,null,null,96,115,65,375,360,233,74,337,173,318,303,300,null,726,315,407,296,347,82,135,416,100,239,150,121,702,120,312,473,303,267,353,394,null,350,432,863,304,169,null,376,100,105,373,374,400,294,486,144,144,119,480,null,null,431,292,308,276,154,259,71,245,262,792,null,110,195,342,317,158,235,120,61,230,529,254,277,182,185]
["Dallas, TX 75201",492,583,646,495,364,657,473,null,null,null,822,681,661,379,458,582,746,654,600,492,563,449,726,null,738,797,501,636,666,627,391,827,510,784,632,23,724,808,815,485,719,401,397,null,776,398,430,682,598,null,799,674,671,458,419,347,581,332,629,633,611,354,null,null,1066,683,455,578,644,786,662,535,568,275,null,640,532,649,790,658,577,676,733,710,952,476,597,568,798]
["Deming, NM",243,126,235,322,475,83,236,null,null,null,411,201,250,445,263,183,401,92,447,504,146,352,315,738,null,681,251,102,320,246,330,415,321,349,308,727,289,571,742,248,48,407,332,null,38,326,708,61,355,null,61,328,213,268,300,417,156,406,386,223,273,385,null,null,329,566,332,462,401,150,249,431,176,653,null,296,304,96,53,157,422,364,387,86,214,363,139,264,281]
["Denver, CO",505,549,450,774,434,641,550,null,null,null,362,481,433,445,586,492,312,622,261,302,562,454,407,797,681,null,521,637,335,440,641,380,436,584,373,769,524,201,64,528,632,443,580,null,716,657,1039,616,327,null,741,353,471,598,559,546,552,662,334,463,424,657,null,null,865,116,472,219,277,652,441,305,520,922,null,392,392,643,683,523,259,289,326,595,894,397,535,410,597]
["Dexter, NM 88230",17,126,216,249,230,217,26,null,null,null,392,215,231,213,62,107,316,198,288,289,106,127,296,501,251,521,null,214,241,176,109,401,107,358,213,490,299,491,583,7,227,182,95,null,290,133,565,194,201,null,313,249,246,74,74,181,104,192,232,177,185,184,null,null,580,413,108,308,295,310,236,277,92,512,null,214,156,221,305,182,268,279,307,234,466,177,121,119,372]
["El Paso, TX",205,89,268,220,438,22,204,null,null,null,443,233,282,400,169,146,434,25,403,438,108,314,347,636,102,637,214,null,352,241,236,447,284,382,340,626,322,603,698,223,83,369,238,null,140,232,607,46,311,null,163,360,246,174,242,347,119,305,342,255,257,284,null,null,430,523,295,418,433,252,282,387,139,552,null,329,266,13,154,190,378,397,419,119,316,326,101,226,376]
["Espanola, NM",218,244,88,487,306,333,264,null,null,null,170,120,72,315,299,186,81,342,99,242,256,239,82,666,320,335,241,352,null,94,355,174,178,224,45,641,164,251,396,242,273,292,333,null,356,371,802,310,93,null,381,18,111,311,312,338,247,424,70,117,78,419,null,null,505,221,247,140,82,293,82,168,215,731,null,26,134,348,323,163,159,46,67,236,535,193,230,121,237]
["Estancia, NM",154,153,55,423,267,259,200,null,null,null,230,66,70,275,235,96,175,226,206,263,166,182,135,627,246,440,176,241,94,null,291,235,122,192,67,602,132,346,501,178,197,253,269,null,281,307,738,235,114,null,306,103,79,248,249,282,157,361,145,23,16,355,null,null,473,326,191,221,176,217,69,190,125,667,null,69,96,272,248,88,181,139,162,160,459,154,140,64,205]
["Eunice, NM",132,203,336,169,243,250,92,null,null,null,512,335,351,221,68,222,436,241,408,335,182,152,416,391,330,641,109,236,355,291,null,516,205,473,327,381,413,606,702,103,312,191,20,null,368,23,479,275,316,null,391,363,360,73,45,125,219,82,347,292,300,73,null,null,659,527,132,423,410,425,351,300,207,413,null,329,250,250,383,296,345,394,422,347,544,228,208,234,487]
["Farmington, NM",379,390,183,667,467,428,425,null,null,null,18,215,165,475,460,333,112,437,265,418,403,400,100,827,415,380,401,447,174,235,516,null,339,111,221,801,137,222,436,402,366,452,494,null,388,531,963,403,268,null,415,192,204,472,473,499,393,585,236,244,218,579,null,null,391,309,408,375,246,275,170,344,362,892,null,209,295,441,373,257,335,213,124,329,442,353,377,282,147]
["Ft. Sumner, NM",84,196,159,353,166,287,130,null,null,null,335,166,174,148,166,138,259,268,202,195,195,60,239,510,321,436,107,284,178,122,205,339,null,297,145,468,237,447,498,108,297,118,181,null,360,226,665,263,111,null,383,187,184,178,160,160,170,269,142,123,123,264,null,null,578,322,69,218,205,317,174,187,157,548,null,152,44,291,348,188,177,189,245,260,536,82,183,58,310]
["Gallup, NM",336,325,140,601,424,362,382,null,null,null,126,149,153,432,417,267,224,371,350,407,337,357,150,784,349,584,358,382,224,192,473,111,297,null,211,760,62,334,645,360,301,410,452,null,270,489,921,339,258,null,297,231,140,430,431,457,328,543,289,193,176,537,null,null,283,470,366,365,304,157,143,334,297,850,null,199,253,376,255,192,325,267,212,264,335,311,312,240,37]
{"$rows_left_out":78}